{"text_format":"1","workbook":"xlsx","n_sheets":17,"sheets":["Start","HELP","CERT","Max Levy Hearing Notice","Fund Bal","Local EMC Support","Re-Est Exp P1","Re-Est Exp P2","Re-Est Revenues","EXP P1","EXP P2","REVENUES","BUD SUM","LT DEBT","Errors","Publication_Date_Calculator","Backfill Payment Breakout"],"not_rendered":{"charts":0,"images":8,"macros":1,"external_links":3,"defined_names":187,"comments":10,"pivot_tables":0},"unopened":[],"bounds":{"document_bytes":16777216,"sheet_cells":100000,"rows_first":2000,"rows_last":500,"rows_between":2000,"halvings":0,"cell_chars":16384,"cell_head_chars":4096},"cells_cut":0,"cells_raw":0,"read":"whole","date_system":"1900"}

{"sheet":"Start","index":0,"n_rows":992,"n_cols":29,"rows_kept":992,"cut":false,"hidden":true,"merged":[]}
[null,null,null,null,null,null,null,null,null,"2010 Census","2020 Census",null,{"$f":"VLOOKUP(certback,Start!$C$7:$H$992,6,0)","v":{"$error":"#N/A"}},"MAX LEVY",null,null,"g_cert_reg_wge","g_cert_rgl_reqwutrep","g_cert_cub_reqwutrep","g_cert_ompot_reqwutrep","g_cert_rimcc_reqwutrep","g_cert_omcocc_reqwutrep","g_cert_psdp_reqwutrep","g_cert_lpsi_reqwutrep","g_cert_slemc_reqwutrep","g_cert_emer_reqwutrep","g_cert_pfr_reqwutrep","g_cert_fipers_reqwutrep","g_cert_oeb_reqwutrep"]
[1,2,3,4,5,1,null,null,"ACKLEY",1589,1599,null,null,"CITY #","CODE","CITY NAME","VALUATION","Regular General","Contract for use of Bridge","Opr & Maint publicly owned Transit","Rent, Ins. Maint of Civic Center","Opr & Maint of City owned Civic Center","Planning a Sanitary Disposal Project","Liability, property & self insurance costs","Support of a Local  Emerg.Mgmt.Comm.","Emergency (if general fund at levy limit)","Police & Fire Retirement","FICA & IPERS (if general fund at levy limit)","Other Employee Benefits"]
["num","county","CITY","BENEFITED ","processing ","result",null,null,"ACKWORTH",83,115,null,null,388,"42G388","ACKLEY",43563672,352866,0,0,0,5881,0,53772,0,11762,0,69000,81000]
[null,null,"NAME","FIRE DIST","CODE",null,null,null,"ADAIR",781,791,null,null,869,"91G869","ACKWORTH",5485062,20182,0,0,0,0,0,0,0,0,0,0,0]
[null,null,null,null,null,null,null,null,"ADEL",3682,6153,null,null,1,"01G001","ADAIR",24349406,197231,0,0,0,0,0,48500,0,0,0,51000,0]
[1,"Type in you city name first",null," "," "," ",null,null,"AFTON",845,874,null,null,228,"25G228","ADEL",174100740,1410216,0,0,0,0,0,65184,0,47007,0,243716,384124]
[2,"HARDIN & FRANKLIN ","ACKLEY",null,"42-388","HARDIN & FRANKLIN ",null,"42G388","AGENCY",638,620,null,null,846,"88G846","AFTON",19371774,156912,0,0,0,0,0,35000,0,0,0,10914,11592]
[3,"WARREN","ACKWORTH",null,"91-869","WARREN",null,"91G869","AINSWORTH",567,511,null,null,862,"90G862","AGENCY",15639652,126682,0,0,0,0,0,0,0,0,0,0,0]
{"$rows_left_out":985}
{"sheet":"HELP","index":1,"n_rows":2210,"n_cols":3,"rows_kept":2210,"cut":false,"hidden":false,"merged":[[1783,2,1784,2],[1761,2,1762,2],[1379,0,1380,0],[72,2,74,2],[865,1,866,1],[1773,2,1774,2]]}
[null,"City Budget Help"]
[null,"To return to the budget forms, click on the appropriate worksheet tab (CERT, Re-Est Revenues, etc. ) "]
[null,"Click on any of the following links to obtain the information you need"]
[null,"Administrative Rules   ( Amendments, Fund Transfers, Employee Benefits, Etc. )"]
[null,"Amendments     ( When is an amendment required? )"]
[null,"Amendment Filing Requirements     ( Timelines & required forms, etc. )"]
[null,"Budget Instructions    ( An overview of how to prepare the city  budget, fund types, etc. ) "]
[null,"Budget Instructions For Beginners   ( Definitions, Forms, and How they are completed ) "]
{"$rows_left_out":2203}
{"sheet":"CERT","index":2,"n_rows":82,"n_cols":19,"rows_kept":82,"cut":false,"hidden":false,"merged":[[15,11,15,12],[9,1,9,5],[18,1,19,6],[4,3,4,5],[4,7,4,10],[7,1,7,10],[0,2,0,4],[1,9,1,12],[14,8,14,9],[14,11,14,12],[3,12,3,14],[6,1,6,14],[0,5,0,6],[0,8,0,11],[0,12,0,15],[13,11,13,12],[13,14,14,14],[3,4,3,10],[12,1,15,4],[15,8,15,9],[13,8,13,9],[8,1,8,5]]}
[null,null,null,null,null,null,null,null,"If you are connected to the INTERNET, verify your Property Valuations by lefting click the appropriate link at right. You may also subit  ",null,null,null,"CHECK CITY VALUATIONS\nTaxable Valuations by individual levy authority",null,null,null,null,null,{"$f":"#REF!","v":{"$error":"#REF!"}}]
["2022-11-17",1,"Form  635.1",null,null,null,null,null,null,null,null,null,null,"Department of Management",null,null,null,null,{"$f":"#REF!","v":{"$error":"#REF!"}}]
[{"$f":"IF(D5>0,VLOOKUP($D$5,Start!$C$7:$E$992,2,FALSE),\"\")","v":""},null,null,null,"         Adoption of Budget and Certification of City Taxes",null,null,null,null,null,null,{"$f":"IF(D5>0,VLOOKUP($D$5,Start!$C$7:$E$992,3,FALSE),\"\")","v":""}]
[null,null,null,null,"CITY BUDGET DRAFR WORKPAPER - NOT FOR PUBLICATION",null,null,null,null,null,null,null,null,null,null,{"$f":"DATE('BUD SUM'!$H$2-2,7,1)","v":44743}]
[null,"   The City of:",null,null,null,null,"        County Name:",{"$f":"IF(D5>0,VLOOKUP($D$5,Start!C7:F992,4,FALSE),\"\")","v":""},{"$f":"VLOOKUP($D$5,Start!$C$7:$E$992,3,FALSE)","v":{"$error":"#N/A"}},{"$f":"VLOOKUP($D$5,Start!$C$7:$E$992,3,FALSE)","v":{"$error":"#N/A"}},{"$f":"VLOOKUP($D$5,Start!$C$7:$E$992,3,FALSE)","v":{"$error":"#N/A"}}]
[null,null,{"$f":"IF($D$5=0,\"TYPE THE CITY NAME ONLY ON THE LINE ABOVE\",\"\")","v":"TYPE THE CITY NAME ONLY ON THE LINE ABOVE"}]
[null,"The below-signed certifies that the City Council, on the date stated above, lawfully approved the named resolution adopting a budget for next fiscal year, as summarized on this and the supporting pages."]
[null,"Attached is Long Term Debt Schedule Form 703 which lists any and all of the debt service obligations of the City."]
{"$rows_left_out":75}
{"sheet":"Max Levy Hearing Notice","index":3,"n_rows":33,"n_cols":10,"rows_kept":33,"cut":false,"hidden":false,"merged":[[0,2,0,6],[1,2,1,6],[8,1,8,2],[2,1,2,7],[3,1,3,2],[4,1,4,2],[5,1,5,2],[6,1,6,2],[7,1,7,2],[21,1,21,2],[9,1,9,2],[10,1,10,2],[11,1,11,2],[12,1,12,2],[13,1,13,2],[14,1,14,2],[16,1,16,2],[17,1,17,2],[18,1,18,2],[19,1,19,2],[20,1,20,2],[22,1,22,2],[23,1,23,2],[24,1,24,7],[25,1,25,7],[28,1,28,7]]}
[null,"CITY NAME","NOTICE OF PUBLIC HEARING -PROPOSED PROPERTY TAX LEVY",null,null,null,null,"CITY CODE",null,"HELP"]
[null,{"$f":"IF(ISBLANK(certback),\"\",certback)","v":""},"Fiscal Year July 1, 2023 - June 30, 2024",null,null,null,null,{"$f":"IF(ISBLANK(CERT!$L$3),\"\",CERT!$L$3)","v":""}]
[]
[null,"Iowa Department of Management",null," ","Current Year Certified Property Tax","Budget Year Effective Property Tax","Budget Year Proposed Maximum Property Tax","Annual"]
[null,null,null," ","2022/2023","2023/2024**","2023/2024","% CHG"]
[null,"Regular Taxable Valuation",null,1,{"$f":"IFERROR(VLOOKUP(Start!$M$1,Max_Levy_Lookup,3,0),0)","v":0},{"$f":"G6","v":0}]
[]
[null,"Tax Levies:"]
{"$rows_left_out":26}
{"sheet":"Fund Bal","index":4,"n_rows":32,"n_cols":13,"rows_kept":32,"cut":false,"hidden":false,"merged":[[30,1,30,12],[0,1,0,12],[31,0,31,12]]}
[]
["Form FBW",null,null,null,null,null,null,null,null,null,null,"          Department of Management"]
[]
[{"$f":"IF(certback<>\"\",VALUE(RIGHT(CERT!$L$3,3)),\"\")","v":""},null,null,null,"    Fund Balance Worksheet for City of",null,null,null,{"$f":"IF(CERT!$D$5=0,\"\",CERT!$D$5)","v":""}]
[{"$f":"IF(A4=\"\",1,0)","v":1}]
[null,null,null,null,null,null,"TIF",null,null,null,"Total",null,"Grand"]
[null,null,null,null,"General","Special Rev","Special Rev","Debt Serv","Capt Proj","Permanent","Government","Proprietary","Total"]
[null,-1,null,null,"( A )","( B )","( C )","( D )","( E )","( G )","( H )","( I )","( J )"]
{"$rows_left_out":25}
{"sheet":"Local EMC Support","index":5,"n_rows":66,"n_cols":15,"rows_kept":66,"cut":false,"hidden":false,"merged":[[6,11,6,15],[0,12,0,14]]}
["Form EMC ",null,null,null,null,null,null,null,null,null,null,"CITY OF",{"$f":"IF(certback>2048,certback,\"\")","v":""}]
[]
[]
[]
[]
[]
[null,null,null,null,null,null,null,null,null,null,null,"As provided in Iowa Code Section 384.12, subsection 22, a city may levy the amount necessary in support of a local Emergency Management Commission.  In addition to  this individual levy, Emergency Management Commission support may also be included as part of the General Fund Levy.  Iowa Code Section 29C.17, subsection 5 states that any support from cities or counties must be separately reported on tax statements issued by the county treasurer."]
[null,null,null,null,null,null,null,null,null,null,null,"Input the amount of General Fund Levy request to be used for support of an Emergency Management Commission.  The total below will reflect the total amount of Emergency Management Commission support provided by the City."]
{"$rows_left_out":59}
{"sheet":"Re-Est Exp P1","index":6,"n_rows":49,"n_cols":11,"rows_kept":49,"cut":false,"hidden":false,"merged":[[4,0,5,1]]}
["           Form 631 E P1",null,null," CITY OF  ",{"$f":"IF(CERT!$D$5>2048,CERT!$D$5,\"\")","v":""},null,null,null,null,"                  Department of Management"]
[{"$f":"'Fund Bal'!$A$4","v":""},null,null,"RE-ESTIMATED   EXPENDITURES SCHEDULE PAGE 1"]
[null,null,null,"    RE-ESTIMATED   Fiscal Year Ending",null,null,null,{"$f":"'BUD SUM'!$H$2-1","v":2023},null,"        Fiscal Years"]
[null,null,null,null,"TIF"]
["GOVERNMENT ACTIVITIES",null,null,"SPECIAL","SPECIAL","DEBT","CAPITAL",null,null,"RE-ESTIMATED","ACTUAL"]
[null,null,"GENERAL","REVENUE","REVENUES","SERVICE","PROJECTS","PERMANENT","PROPRIETARY",{"$f":"'BUD SUM'!$K$5","v":2023},{"$f":"'BUD SUM'!$L$5","v":2022}]
["(A)","(B)","(C)","(D)","(E)","(F)","(G)","(H)","(I)","(J)","(K)"]
["PUBLIC SAFETY"]
{"$rows_left_out":42}
{"sheet":"Re-Est Exp P2","index":7,"n_rows":58,"n_cols":11,"rows_kept":58,"cut":false,"hidden":false,"merged":[[4,0,5,1],[1,8,1,10]]}
["           Form 631 E P2",null,null,"  CITY OF ",null,{"$f":"IF(CERT!$D$5>2048,CERT!$D$5,\"\")","v":""},null,null,null,"                  Department of Management"]
[{"$f":"'Fund Bal'!$A$4","v":""},null,null,"RE-ESTIMATED   EXPENDITURES SCHEDULE PAGE 2"]
[null,null,null,"     RE-ESTIMATED",null,"  Fiscal Year Ending",null,{"$f":"'BUD SUM'!$H$2-1","v":2023},null,"                 Fiscal Years"]
[null,null,null,null,"TIF"]
["GOVERNMENT ACTIVITIES  CONT.",null,null,"SPECIAL","SPECIAL","DEBT","CAPITAL",null,null,"RE-ESTIMATED","ACTUAL"]
[null,null,"GENERAL","REVENUES","REVENUES","SERVICE","PROJECTS","PERMANENT","PROPRIETARY",{"$f":"'BUD SUM'!$K$5","v":2023},{"$f":"'BUD SUM'!$L$5","v":2022}]
["(A)","(B)","(C)","(D)","(E)","(F)","(G)","(H)","(I)","(J)","(K)"]
["COMMUNITY & ECONOMIC DEVELOPMENT"]
{"$rows_left_out":51}
{"sheet":"Re-Est Revenues","index":8,"n_rows":58,"n_cols":12,"rows_kept":58,"cut":false,"hidden":false,"merged":[]}
["Form 631.D",null,null,null,"  CITY OF ",null,{"$f":"IF(CERT!$D$5>2048,CERT!$D$5,\"\")","v":""},null,null,null,"                  Department of Management"]
[{"$f":"'Fund Bal'!$A$4","v":""},null,null,null,"                       RE-ESTIMATED   REVENUES   DETAIL"]
[null,null,null,null,"                RE-ESTIMATED Fiscal Year Ending",null,null,null,{"$f":"'BUD SUM'!$H$2-1","v":2023},null,"         Fiscal Years"]
[null,null,null,null,null,"TIF"]
[null,null,null,null,"SPECIAL","SPECIAL","DEBT","CAPITAL",null,null,"RE-ESTIMATED","ACTUAL"]
[null,null,null,"GENERAL","REVENUES","REVENUES","SERVICE","PROJECTS","PERMANENT","PROPRIETARY",{"$f":"'BUD SUM'!$K$5","v":2023},{"$f":"'BUD SUM'!$L$5","v":2022}]
["(A)",null,"(B)","(C)","(D)","(E)","(F)","(G)","(H)","(I)","(J)","(K)"]
["REVENUES & OTHER FINANCING SOURCES"]
{"$rows_left_out":51}
{"sheet":"EXP P1","index":9,"n_rows":49,"n_cols":12,"rows_kept":49,"cut":false,"hidden":false,"merged":[[4,0,5,1],[1,10,1,11]]}
["           Form 631 A P1",null,null," CITY OF  ",null,{"$f":"IF(CERT!$D$5>2048,CERT!$D$5,\"\")","v":""},null,null,null,null,"                  Department of Management"]
[null,null,null,"           EXPENDITURES SCHEDULE PAGE 1",null,null,null,null,null,null,{"$f":"IF('EXP P2'!K48+'EXP P2'!L48=0,\"The last two columns will fill in once the Re-Est forms are completed\",\"\")","v":"The last two columns will fill in once the Re-Est forms are completed"}]
[null,null,null,null,null,"   Fiscal Year Ending",null,{"$f":"'BUD SUM'!$H$2","v":2024},null,"                 Fiscal Years"]
[null,null,null,null,"TIF"]
["GOVERNMENT ACTIVITIES",null,null,"SPECIAL","SPECIAL","DEBT","CAPITAL",null,null,"BUDGET","RE-ESTIMATED","ACTUAL"]
[null,null,"GENERAL","REVENUES","REVENUES","SERVICE","PROJECTS","PERMANENT","PROPRIETARY",{"$f":"'BUD SUM'!$J$5","v":2024},{"$f":"'BUD SUM'!$K$5","v":2023},{"$f":"'BUD SUM'!$L$5","v":2022}]
["(A)","(B)","(C)","(D)","(E)","(F)","(G)","(H)","(I)","(J)","(K)","(L)"]
["PUBLIC SAFETY"]
{"$rows_left_out":42}
{"sheet":"EXP P2","index":10,"n_rows":55,"n_cols":12,"rows_kept":55,"cut":false,"hidden":false,"merged":[[1,10,1,11],[4,0,5,1]]}
["           Form 631 A P2",null,null," CITY OF  ",{"$f":"IF(CERT!$D$5>2048,CERT!$D$5,\"\")","v":""},null,null,null,null,null,"                  Department of Management"]
[null,null,null,"           EXPENDITURES SCHEDULE PAGE 2",null,null,null,null,null,null,{"$f":"IF('EXP P2'!L48+'EXP P2'!M48=0,\"The last two columns will fill in once the Re-Est forms are completed\",\"\")","v":"The last two columns will fill in once the Re-Est forms are completed"}]
[null,null,null,null,null,"Fiscal Year Ending",null,{"$f":"'BUD SUM'!$H$2","v":2024},null,"                 Fiscal Years"]
[null,null,null,null,"TIF"]
["GOVERNMENT ACTIVITIES  CONT.",null,null,"SPECIAL","SPECIAL","DEBT","CAPITAL",null,null,"BUDGET","RE-ESTIMATED","ACTUAL"]
[null,null,"GENERAL","REVENUES","REVENUES","SERVICE","PROJECTS","PERMANENT","PROPRIETARY",{"$f":"'BUD SUM'!$J$5","v":2024},{"$f":"'BUD SUM'!$K$5","v":2023},{"$f":"'BUD SUM'!$L$5","v":2022}]
["(A)","(B)","(C)","(D)","(E)","(F)","(G)","(H)","(I)","(J)","(K)","(L)"]
["COMMUNITY & ECONOMIC DEVELOPMENT"]
{"$rows_left_out":48}
{"sheet":"REVENUES","index":11,"n_rows":58,"n_cols":13,"rows_kept":58,"cut":false,"hidden":false,"merged":[[1,11,1,12],[6,0,6,1],[1,0,5,1],[76,4,80,5],[15,0,15,1]]}
["Form 631 B",null,null,null,"CITY OF ",null,{"$f":"IF(CERT!$D$5>2048,CERT!$D$5,\"\")","v":""},null,null,null,null,"Department of Management"]
[null,null,null,"REVENUES  DETAIL",null,null,null,null,null,null,null,{"$f":"IF('EXP P2'!M48+'EXP P2'!N48=0,\"The last two columns will fill in once the Re-Est forms are completed\",\"\")","v":"The last two columns will fill in once the Re-Est forms are completed"}]
[null,null,null,null,null,null,"  Fiscal Year Ending",null,{"$f":"'BUD SUM'!$H$2","v":2024},null,"                   Fiscal Years"]
[null,null,null,null,null,"TIF"]
[null,null,null,null,"SPECIAL","SPECIAL","DEBT","CAPITAL",null,null,"BUDGET","RE-ESTIMATED","ACTUAL"]
[null,null,null,"GENERAL","REVENUES","REVENUES","SERVICE","PROJECTS","PERMANENT","PROPRIETARY",{"$f":"'BUD SUM'!$J$5","v":2024},{"$f":"'BUD SUM'!$K$5","v":2023},{"$f":"'BUD SUM'!$L$5","v":2022}]
["(A)            ",null,"(B)","(C)","(D)","(E)","(F)","(G)","(H)","(I)","(J)","(K)","(L)"]
["REVENUES & OTHER FINANCING SOURCES"]
{"$rows_left_out":51}
{"sheet":"BUD SUM","index":12,"n_rows":44,"n_cols":12,"rows_kept":44,"cut":false,"hidden":false,"merged":[[1,3,1,6],[0,4,0,6]]}
["Form 635.2A",null,"              CITY OF  ",null,{"$f":"IF(CERT!$D$5>2048,CERT!$D$5,\"\")","v":""},null,null,null,null,null,"Department of Management"]
[null,null,null,"ADOPTED BUDGET SUMMARY         YEAR ENDED JUNE 30, ",null,null,null,2024,null,null,"Fiscal Years"]
[null,null,null,null,"TIF"]
[null,null,null,"SPECIAL","SPECIAL","DEBT","CAPITAL",null,null,"BUDGET","RE-ESTIMATED","ACTUAL"]
[null,null,"GENERAL","REVENUES","REVENUES","SERVICE","PROJECTS","PERMANENT","PROPRIETARY",2024,{"$f":"$J$5-1","v":2023},{"$f":"$J$5-2","v":2022}]
["(A)","(B)","(C)","(D)","(E)","(F)","(G)","(H)","(I)","(J)","(K)","(L)"]
["Revenues & Other Financing Sources"]
["Taxes Levied on Property",1,{"$f":"REVENUES!D9","v":0},{"$f":"REVENUES!E9","v":0},null,{"$f":"REVENUES!G9","v":0},{"$f":"REVENUES!H9","v":0},null,null,{"$f":"SUM(C8:I8)","v":0},{"$f":"REVENUES!L9","v":0},{"$f":"REVENUES!M9","v":0}]
{"$rows_left_out":37}
{"sheet":"LT DEBT","index":13,"n_rows":302,"n_cols":18,"rows_kept":302,"cut":false,"hidden":false,"merged":[[13,1,13,2],[14,1,14,2],[15,1,15,2],[16,1,16,2],[17,1,17,2],[18,1,18,2],[25,1,25,2],[26,1,26,2],[27,1,27,2],[28,1,28,2],[29,1,29,2],[30,1,30,2],[19,1,19,2],[20,1,20,2],[21,1,21,2],[22,1,22,2],[23,1,23,2],[24,1,24,2],[37,1,37,2],[38,1,38,2],[39,1,39,2],[40,1,40,2],[41,1,41,2],[42,1,42,2],[31,1,31,2],[32,1,32,2],[33,1,33,2],[34,1,34,2],[35,1,35,2],[36,1,36,2],[61,1,61,2],[62,1,62,2],[63,1,63,2],[64,1,64,2],[65,1,65,2],[66,1,66,2],[43,0,44,4],[56,1,56,2],[57,1,57,2],[58,1,58,2],[59,1,59,2],[60,1,60,2],[73,1,73,2],[74,1,74,2],[75,1,75,2],[76,1,76,2],[77,1,77,2],[78,1,78,2],[67,1,67,2],[68,1,68,2],[69,1,69,2],[70,1,70,2],[71,1,71,2],[72,1,72,2],[85,1,85,2],[99,1,99,2],[100,1,100,2],[101,1,101,2],[102,1,102,2],[103,1,103,2],[79,1,79,2],[80,1,80,2],[81,1,81,2],[82,1,82,2],[83,1,83,2],[84,1,84,2],[110,1,110,2],[111,1,111,2],[112,1,112,2],[113,1,113,2],[114,1,114,2],[115,1,115,2],[104,1,104,2],[105,1,105,2],[106,1,106,2],[107,1,107,2],[108,1,108,2],[109,1,109,2],[122,1,122,2],[123,1,123,2],[124,1,124,2],[125,1,125,2],[126,1,126,2],[127,1,127,2],[116,1,116,2],[117,1,117,2],[118,1,118,2],[119,1,119,2],[120,1,120,2],[121,1,121,2],[147,1,147,2],[148,1,148,2],[149,1,149,2],[150,1,150,2],[151,1,151,2],[152,1,152,2],[128,1,128,2],[142,1,142,2],[143,1,143,2],[144,1,144,2],[145,1,145,2],[146,1,146,2],[159,1,159,2],[160,1,160,2],[161,1,161,2],[162,1,162,2],[163,1,163,2],[164,1,164,2],[153,1,153,2],[154,1,154,2],[155,1,155,2],[156,1,156,2],[157,1,157,2],[158,1,158,2],[171,1,171,2],[185,1,185,2],[186,1,186,2],[187,1,187,2],[188,1,188,2],[189,1,189,2],[165,1,165,2],[166,1,166,2],[167,1,167,2],[168,1,168,2],[169,1,169,2],[170,1,170,2],[196,1,196,2],[197,1,197,2],[198,1,198,2],[199,1,199,2],[200,1,200,2],[201,1,201,2],[190,1,190,2],[191,1,191,2],[192,1,192,2],[193,1,193,2],[194,1,194,2],[195,1,195,2],[208,1,208,2],[209,1,209,2],[210,1,210,2],[211,1,211,2],[212,1,212,2],[213,1,213,2],[202,1,202,2],[203,1,203,2],[204,1,204,2],[205,1,205,2],[206,1,206,2],[207,1,207,2],[233,1,233,2],[234,1,234,2],[235,1,235,2],[236,1,236,2],[237,1,237,2],[238,1,238,2],[214,1,214,2],[228,1,228,2],[229,1,229,2],[230,1,230,2],[231,1,231,2],[232,1,232,2],[245,1,245,2],[246,1,246,2],[247,1,247,2],[248,1,248,2],[249,1,249,2],[250,1,250,2],[239,1,239,2],[240,1,240,2],[241,1,241,2],[242,1,242,2],[243,1,243,2],[244,1,244,2],[257,1,257,2],[271,1,271,2],[272,1,272,2],[273,1,273,2],[274,1,274,2],[275,1,275,2],[251,1,251,2],[252,1,252,2],[253,1,253,2],[254,1,254,2],[255,1,255,2],[256,1,256,2],[282,1,282,2],[283,1,283,2],[284,1,284,2],[285,1,285,2],[286,1,286,2],[287,1,287,2],[276,1,276,2],[277,1,277,2],[278,1,278,2],[279,1,279,2],[280,1,280,2],[281,1,281,2],[300,1,300,2],[294,1,294,2],[295,1,295,2],[296,1,296,2],[297,1,297,2],[298,1,298,2],[299,1,299,2],[288,1,288,2],[289,1,289,2],[290,1,290,2],[291,1,291,2],[292,1,292,2],[293,1,293,2]]}
["Form 703",null,null,null,null,null,null,null,null,null,null,null,"Department of Management",{"$f":"SUM(SUMIF($P$14:$P$43,2,$L$14:$L$43),SUMIF($P$57:$P$86,2,$L$57:$L$86),SUMIF($P$100:$P$129,2,$L$100:$L$129),SUMIF($P$143:$P$172,2,$L$143:$L$172),SUMIF($P$186:$P$215,2,$L$186:$L$215),SUMIF($P$229:$P$258,2,$L$229:$L$258),SUMIF($P$272:$P$301,2,$L$272:$L$301))","v":0}]
["LONG TERM DEBT SCHEDULE"]
["GENERAL OBLIGATION BONDS, TIF BONDS, REVENUE BONDS, LOANS, LEASE-PURCHASE PAYMENTS"]
["                                                                                                                                                                                                     PAGE  1",null,null,null,null,null,null,null,null,null,null,null,"Fiscal Year",null,null,null,1,"NO SELECTION"]
[null,"       City Name:",{"$f":"IF(CERT!$D$5>2048,CERT!$D$5,\"\")","v":""},null,null,null,null,null,null,null,null,null,{"$f":"'BUD SUM'!$H$2","v":2024},null,null,null,2,"GO"]
[null,null,null,null,null,"GO - TOTAL",{"$f":"SUMIF($P$14:$P$43,2,G$14:G$43)+SUMIF($P$57:$P$86,2,G$57:G$86)+SUMIF($P$100:$P$129,2,G$100:G$129)+SUMIF($P$143:$P$172,2,G$143:G$172)+SUMIF($P$186:$P$215,2,G$186:G$215)+SUMIF($P$229:$P$258,2,G$229:G$258)+SUMIF($P$272:$P$301,2,G$272:G$301)","v":0},0,0,0,0,0,{"$f":"SUMIF($P$14:$P$43,2,M$14:M$43)+SUMIF($P$57:$P$86,2,M$57:M$86)+SUMIF($P$100:$P$129,2,M$100:M$129)+SUMIF($P$143:$P$172,2,M$143:M$172)+SUMIF($P$186:$P$215,2,M$186:M$215)+SUMIF($P$229:$P$258,2,M$229:M$258)+SUMIF($P$272:$P$301,2,M$272:M$301)","v":0},null,null,null,3,"NON - GO"]
[null,null,null,null,null,"NON-GO TOTAL",{"$f":"SUMIF($P$14:$P$43,3,G$14:G$43)+SUMIF($P$57:$P$86,3,G$57:G$86)+SUMIF($P$100:$P$129,3,G$100:G$129)+SUMIF($P$143:$P$172,3,G$143:G$172)+SUMIF($P$186:$P$215,3,G$186:G$215)+SUMIF($P$229:$P$258,3,G$229:G$258)+SUMIF($P$272:$P$301,3,G$272:G$301)","v":0},0,0,0,0,0,{"$f":"SUMIF($P$14:$P$43,3,M$14:M$43)+SUMIF($P$57:$P$86,3,M$57:M$86)+SUMIF($P$100:$P$129,3,M$100:M$129)+SUMIF($P$143:$P$172,3,M$143:M$172)+SUMIF($P$186:$P$215,3,M$186:M$215)+SUMIF($P$229:$P$258,3,M$229:M$258)+SUMIF($P$272:$P$301,3,M$272:M$301)","v":0}]
[null,null,null,null,null,"GRAND TOTAL",{"$f":"G302","v":0},{"$f":"H302","v":0},0,0,0,0,0]
{"$rows_left_out":295}
{"sheet":"Errors","index":14,"n_rows":194,"n_cols":16,"rows_kept":194,"cut":false,"hidden":false,"merged":[[44,1,44,19],[45,1,45,19],[41,1,41,19],[42,1,42,19],[39,1,39,19],[43,1,43,19],[35,1,35,19],[31,1,31,19],[37,1,37,19],[33,7,33,14],[6,0,6,19],[17,1,17,19],[7,1,7,19],[9,1,9,19],[12,1,12,19],[13,1,13,19],[20,1,20,19],[21,1,21,19],[32,1,32,4],[25,1,25,19],[22,14,23,19],[39,0,40,0],[8,0,10,0],[15,0,18,0],[11,0,14,0],[8,1,8,19],[14,1,14,19],[28,1,28,19],[23,12,23,13],[18,1,18,19],[10,1,10,19],[22,12,22,13],[11,1,11,19],[16,1,16,19],[33,1,33,4],[24,0,25,0],[20,0,21,0],[0,0,0,19],[85,0,87,0],[1,0,4,19],[5,1,5,19],[38,1,38,19],[19,1,19,19],[15,1,15,19],[36,1,36,19],[32,7,32,14],[34,1,34,19],[40,1,40,19],[24,1,24,19],[26,1,26,19],[29,1,29,19],[30,1,30,19],[27,1,27,19]]}
["ERRORS LISTING PAGE  SCROLL TO VIEW ALL ERROR MESSAGES (You may also print this page)"]
[{"$f":"IF($A$104>0,\"THE BUDGET FILE CONTAINS ERRORS LISTED BELOW OR IS NOT COMPLETE.\",\"CONGRATULATIONS! THE BUDGET FILE CONTAINS NO ERRORS IN THE FOUR CATEGORIES\")","v":"THE BUDGET FILE CONTAINS ERRORS LISTED BELOW OR IS NOT COMPLETE."}]
[]
[]
[]
["(1)","OPERATING TRANSFERS IN / OPERATING TRANSFERS OUT COMPARISONS"]
[{"$f":"IF(REVENUES!$K$51<>'EXP P2'!$J$51,\"The TIF TRANSFERS IN and OUT and the REGULAR TRANSFERS IN and OUT  MUST EQUAL EACH OTHER. In other words, you can't use the TIF Transfer Out and show that same transaction as a Regular Transfer In. This error may be the result of such a transaction.\",IF(REVENUES!$L$51<>'EXP P2'!$K$51,\"The TIF TRANSFERS IN and OUT and the REGULAR TRANSFERS IN and OUT  MUST EQUAL EACH OTHER. In other words, you can't use the TIF Transfer Out and show that same transaction as a Regular Transfer In. This error may be the result of such a transaction.\",IF(REVENUES!$M$51<>'EXP P2'!$L$51,\"The TIF TRANSFERS IN and OUT and the REGULAR TRANSFERS IN and OUT  MUST EQUAL EACH OTHER. In other words, you can't use the TIF Transfer Out and show that same transaction as a Regular Transfer In. This error may be the result of such a transaction.\",\"\")))","v":""}]
[null,{"$f":"IF(REVENUES!$K$51<>'EXP P2'!$J$51,\"The TOTAL Operating TRANSFERS IN   DO NOT   equal TRANSFERS OUT for the Budget year.\",\"\")","v":""}]
{"$rows_left_out":187}
{"sheet":"Publication_Date_Calculator","index":15,"n_rows":8,"n_cols":6,"rows_kept":8,"cut":false,"hidden":false,"merged":[]}
[]
[]
[null,"PUBLICATION DATE CALCULATOR"]
[]
[null,null,"Earliest Publication Date",null,{"$f":"IF(E8<>\"\",E8-20,\"\")","v":""}]
[null,null,"Latest Publication Date",null,{"$f":"IF(E8<>\"\",E8-10,\"\")","v":""}]
[]
[null,null,"Proposed Hearing Date",null,null,"<== Enter Date"]
{"$rows_left_out":1}
{"sheet":"Backfill Payment Breakout","index":16,"n_rows":8,"n_cols":5,"rows_kept":8,"cut":false,"hidden":false,"merged":[]}
[]
[null,"Estimated Amount of Backfill"]
[]
[null,"GENERAL FUND",{"$f":"ROUND($C$2*E4,0)","v":0},null,{"$f":"IFERROR(IF(C2=0,0,ROUND(SUM(CERT!O24,CERT!O27,CERT!O28,CERT!O29,CERT!O30,CERT!O31,CERT!O32,CERT!O34,CERT!O35,CERT!O36,CERT!O38,CERT!O39,CERT!O40,CERT!O41,CERT!O42,CERT!O43,CERT!O44,CERT!O45,CERT!O46,CERT!O47,CERT!O48)/CERT!$O$72,5)),0)","v":0}]
[null,"SPECIAL FUND",{"$f":"ROUND($C$2*E5,0)","v":0},null,{"$f":"IFERROR(IF($C$2=0,0,ROUND(SUM(CERT!$O$53,CERT!$O$57)/CERT!$O$72,5)),0)","v":0}]
[null,"DEBT SERVICE FUND",0,null,{"$f":"IFERROR(IF($C$2=0,0,ROUND(SUM(CERT!$O$70)/CERT!$O$72,5)),0)","v":0}]
[null,"CAPITAL PROJECTS FUND",0,null,{"$f":"IFERROR(IF($C$2=0,0,ROUND(SUM(CERT!$O$71)/CERT!$O$72,5)),0)","v":0}]
[null,null,{"$f":"SUM(C4:C7)","v":0}]